{"text_format":"1","workbook":"xlsx","n_sheets":9,"sheets":["Calc","Corp Borrower 1","Corp Borrower 2","SE","Rental","Calc Data","HEM Table","Instructions","Overview"],"not_rendered":{"charts":0,"images":6,"macros":1,"external_links":0,"defined_names":5,"comments":0,"pivot_tables":0},"unopened":[],"bounds":{"document_bytes":16777216,"sheet_cells":100000,"rows_first":2000,"rows_last":500,"rows_between":2000,"halvings":0,"cell_chars":16384,"cell_head_chars":4096},"cells_cut":0,"cells_raw":0,"read":"whole","date_system":"1900"}

{"sheet":"Calc","index":0,"n_rows":59,"n_cols":40,"rows_kept":59,"cut":false,"hidden":false,"merged":[[53,2,53,4],[54,2,54,4],[46,15,46,16],[54,18,54,19],[46,18,46,19],[49,9,49,10],[49,12,49,13],[43,2,43,4],[53,12,55,13],[55,15,55,16],[44,18,44,19],[53,15,53,16],[55,2,55,4],[53,9,55,10],[50,12,50,13],[47,2,47,4],[46,2,46,4],[45,2,45,4],[44,2,44,4],[49,2,49,4],[48,2,48,4],[53,6,53,7],[54,6,54,7],[48,6,48,7],[42,2,42,4],[41,2,41,4],[24,2,24,6],[32,2,32,4],[30,12,30,13],[30,3,30,4],[42,6,42,7],[38,32,38,34],[38,23,38,31],[30,23,30,25],[33,23,33,25],[42,31,43,34],[42,29,43,30],[39,15,39,16],[26,15,26,16],[26,2,26,4],[27,2,27,4],[26,6,26,7],[26,9,26,10],[32,15,32,16],[30,15,30,16],[40,6,40,7],[41,6,41,7],[43,12,43,13],[22,2,22,4],[22,6,22,7],[22,9,22,10],[40,12,40,13],[40,15,40,16],[39,2,39,4],[32,6,32,7],[31,2,31,4],[33,6,33,7],[33,9,33,10],[34,3,34,4],[34,9,34,10],[34,6,34,7],[31,6,31,7],[39,12,39,13],[39,9,39,10],[33,12,33,13],[32,12,32,13],[39,6,39,7],[40,2,40,4],[26,12,26,13],[25,6,25,7],[40,9,40,10],[33,3,33,4],[44,6,44,7],[44,9,44,10],[43,6,43,7],[43,9,43,10],[49,6,49,7],[45,6,45,7],[45,9,45,10],[29,18,29,19],[31,15,31,16],[32,9,32,10],[41,18,41,19],[42,18,42,19],[41,9,41,10],[41,12,41,13],[42,12,42,13],[42,15,42,16],[42,9,42,10],[34,12,34,13],[41,15,41,16],[46,9,46,10],[43,15,43,16],[34,15,34,16],[28,2,28,4],[31,12,31,13],[29,2,29,4],[30,6,30,7],[30,9,30,10],[26,18,26,19],[28,18,28,19],[27,18,27,19],[29,33,29,34],[30,33,30,34],[26,33,26,34],[32,31,32,34],[33,32,33,34],[33,29,33,31],[33,26,33,28],[27,33,27,34],[28,33,28,34],[26,26,26,28],[27,26,27,28],[28,30,28,31],[30,26,30,28],[29,30,29,31],[29,26,29,28],[28,26,28,28],[30,30,30,31],[32,23,32,30],[48,23,53,34],[47,18,47,19],[47,12,47,13],[51,15,51,16],[46,12,46,13],[44,29,46,34],[45,12,45,13],[49,15,49,16],[47,15,47,16],[44,15,44,16],[44,12,44,13],[46,23,46,28],[56,6,56,7],[56,9,56,10],[45,15,45,16],[51,18,51,19],[52,18,52,19],[52,15,52,16],[56,18,56,19],[53,18,53,19],[50,15,50,16],[50,18,50,19],[56,12,56,16],[55,6,55,7],[48,12,48,13],[46,6,46,7],[47,6,47,7],[48,9,48,10],[49,18,49,19],[48,15,48,16],[54,15,54,16],[2,23,2,34],[11,15,12,16],[13,28,13,30],[3,25,3,26],[26,30,26,31],[13,31,13,34],[58,31,58,35],[45,18,45,19],[55,18,55,19],[48,18,48,19],[43,18,43,19],[40,18,40,19],[44,23,45,28],[42,23,43,28],[41,23,41,34],[34,18,34,19],[39,18,39,19],[40,23,40,34],[34,32,34,34],[33,18,33,19],[32,18,32,19],[30,18,30,19],[31,18,31,19],[34,23,34,25],[11,10,12,11],[15,12,16,12],[13,6,14,6],[13,7,14,9],[13,10,14,11],[5,6,5,10],[5,15,5,19],[15,7,16,9],[5,12,5,13],[13,18,13,20],[11,18,11,20],[11,13,12,14],[11,31,11,34],[23,23,23,27],[24,23,24,27],[24,28,24,34],[25,23,25,34],[3,29,3,34],[27,23,27,25],[27,30,27,31],[11,23,11,26],[8,31,9,34],[11,28,11,30],[8,18,9,30],[2,4,3,19],[13,12,14,12],[15,18,15,20],[9,10,10,11],[11,3,12,5],[13,3,14,5],[13,13,14,14],[9,3,10,5],[9,6,10,6],[9,7,10,9],[11,6,12,6],[11,7,12,9],[21,15,21,16],[21,18,21,19],[22,15,22,16],[25,18,25,19],[25,12,25,13],[15,31,15,34],[15,28,15,30],[15,13,16,14],[21,12,21,13],[34,26,34,28],[34,29,34,31],[25,9,25,10],[21,6,21,7],[9,13,10,14],[9,15,10,16],[13,15,14,16],[15,15,16,16],[20,2,20,6],[9,12,10,12],[15,3,16,5],[11,12,12,12],[15,23,15,26],[15,6,16,6],[15,10,16,11],[29,23,29,25],[28,23,28,25],[13,23,13,26],[33,15,33,16],[31,9,31,10],[21,9,21,10],[22,12,22,13],[22,18,22,19],[25,15,25,16]]}
[]
[]
[null,null,null,null,"GATEWAY COMMERCIAL CAPACITY TEST CALCULATOR V2024.1",null,null,null,null,null,null,null,null,null,null,null,null,null,null,null,null,null,null,"GATEWAY USE ONLY"]
[null,null,null,null,null,null,null,null,null,null,null,null,null,null,null,null,null,null,null,null,null,null,null,"DEAL No.",null,null,null,null,"NAME:"]
[null,null,null,null,"Released Date: 4 April 2024"]
[null,null,null,null,"Field Key",null,"Mandatory and must be completed",null,null,null,null,null,"Optional input fields",null,null,"Output fields and can't be completed"]
[null,null,null,null,null,null,null,null,null,null,null,null,null,null,null,null,null,null,null,null,null,null,null,"NO",null,null,null,null,null,null,null,"NO"]
[]
[null,null,"LOAN DETAILS",null,null,null,null,null,null,null,null,null,null,null,null,null,null,null,"Error: Loan term must be the same as I/O term"]
[null,null,null,"Loan",null,null,"Loan Type","Loan Amount ($)",null,null,"Term (mths)",null,"Rate % p.a.","Int Only Term",null,"Indicative Payment (mthly)"]
[]
[null,null,1,null,null,null,null,null,null,null,null,null,null,null,null,{"$f":"IF(AND(D12<>\"\",G12<>\"\",H12<>\"\",K12<>\"\",M12<>\"\",N12<>\"\"),IF(N12>0,M12/12*H12,PMT(M12/12, K12,-H12)),\"\")","v":""},null,null,"Total New Loans",null,null,null,null,{"$f":"IF(SUM(H12:J17)=0,0,SUM(H12:J17))","v":0},null,null,null,null,"Security Value",null,null,0]
[]
[null,null,2,null,null,null,null,null,null,null,null,null,null,null,null,{"$f":"IF(AND(H14<>\"\",K14<>\"\",M14<>\"\"),IF(N14>0,M14/12*H14,PMT(M14/12, K14,-H14)),\"\")","v":""},null,null,"Existing GBL Loans",null,null,null,null,0,null,null,null,null,"LVR",null,null,{"$f":"IF(AF12=0,0,IF(OR(AF9=\"Family Pledge\",AF9=\"FHLDS\"),80%,X16/AF12))","v":0}]
[]
[null,null,3,null,null,null,null,null,null,null,null,null,null,null,null,{"$f":"IF(AND(H16<>\"\",K16<>\"\",M16<>\"\"),IF(N16>0,M16/12*H16,PMT(M16/12,K16,-H16)),\"\")","v":""},null,null,"Total Loans",null,null,null,null,{"$f":"SUM(X12,X14)","v":0}]
[]
[]
[]
[]
{"$rows_left_out":40}
{"sheet":"Corp Borrower 1","index":1,"n_rows":50,"n_cols":34,"rows_kept":50,"cut":false,"hidden":false,"merged":[[10,2,10,3],[10,8,10,9],[11,8,11,9],[12,8,12,9],[13,8,13,9],[6,3,6,4],[7,2,7,3],[8,2,8,3],[8,8,8,9],[9,2,9,3],[25,11,25,12],[11,2,11,3],[12,2,12,3],[15,2,15,3],[15,8,15,9],[16,2,16,10],[17,2,17,3],[14,8,14,9],[21,2,21,4],[21,5,21,9],[22,11,22,12],[23,11,23,12],[24,11,24,12],[33,2,33,9],[26,11,26,12],[27,11,27,12],[28,11,28,12],[29,11,29,12],[30,11,30,12],[31,2,31,3],[31,7,31,8],[32,2,32,3]]}
[]
[]
[null,null,"BUSINESS BORROWER 1"]
[]
[]
[null,null,null,null,null,"Latest Year",null,"Prior Year"]
[null,null,null,"Period Ending"]
[null,null,"Profit and Loss"]
[null,null,"Net Profit before Tax/Distributions",null,null,0,null,0,{"$f":"IF(OR(H9=\"\",H9=0),\"\",(F9-H9)/H9)","v":""}]
[null,null,"Addbacks"]
[null,null,"Interest Expense",null,null,0,null,0,{"$f":"IF(OR(H11=\"\",H11=0),\"\",(F11-H11)/H11)","v":""}]
[null,null,"Financed Leasing Expense",null,null,0,null,0,{"$f":"IF(OR(H12=\"\",H12=0),\"\",(F12-H12)/H12)","v":""},null,null,null,null,null,null,null,null,null,null,null,null,null,null,null,null,null,null,null,null,null,null,0]
[null,null,"Depreciation/ Amortisation of Intangibles",null,null,0,null,0,""]
[null,null,"Other Addbacks",null,null,0,null,0,"",null,null,null,null,null,null,null,null,null,null,null,null,null,null,0]
[null,null,"Other Addbacks",null,null,0,null,0,""]
[null,null,"Net Profit after Adjustments",null,null,{"$f":"F9+SUM(F11:F15)","v":0},null,{"$f":"H9+SUM(H11:H15)","v":0},""]
[]
[null,null,"Average Net Profit after Adjustments",null,null,{"$f":"AVERAGE(F16,H16)","v":0}]
[]
[]
{"$rows_left_out":31}
{"sheet":"Corp Borrower 2","index":2,"n_rows":34,"n_cols":12,"rows_kept":34,"cut":false,"hidden":false,"merged":[[6,3,6,4],[7,2,7,3],[8,2,8,3],[31,7,31,8],[8,8,8,9],[9,2,9,3],[11,2,11,3],[12,2,12,3],[15,2,15,3],[15,8,15,9],[10,2,10,3],[10,8,10,9],[11,8,11,9],[12,8,12,9],[13,8,13,9],[14,8,14,9],[33,2,33,9],[16,2,16,10],[21,2,21,4],[21,5,21,9],[17,2,17,3],[31,2,31,3],[32,2,32,3],[30,11,30,12],[22,11,22,12],[23,11,23,12],[24,11,24,12],[25,11,25,12],[26,11,26,12],[27,11,27,12],[28,11,28,12],[29,11,29,12]]}
[]
[]
[null,null,"BUSINESS BORROWER 2"]
[]
[]
[null,null,null,null,null,"Latest Year",null,"Prior Year"]
[null,null,null,"Period Ending"]
[null,null,"Profit and Loss"]
[null,null,"Net Profit before Tax/Distributions",null,null,0,null,0,{"$f":"IF(OR(H9=\"\",H9=0),\"\",(F9-H9)/H9)","v":""}]
[null,null,"Addbacks"]
[null,null,"Interest Expense",null,null,0,null,0,{"$f":"IF(OR(H11=\"\",H11=0),\"\",(F11-H11)/H11)","v":""}]
[null,null,"Financed Leasing Expense",null,null,0,null,0,""]
[null,null,"Depreciation/ Amortisation of Intangibles",null,null,0,null,0,""]
[null,null,"Other Addbacks",null,null,0,null,0,""]
[null,null,"Other Addbacks",null,null,0,null,0,""]
[null,null,"Net Profit after Adjustments",null,null,{"$f":"F9+SUM(F11:F15)","v":0},null,{"$f":"H9+SUM(H11:H15)","v":0},{"$f":"IF(OR(H16=\"\",H16=0),\"\",(F16-H16)/H16)","v":""}]
[]
[null,null,"Average Net Profit after Adjustments",null,null,{"$f":"AVERAGE(F16,H16)","v":0}]
[]
[]
{"$rows_left_out":15}
{"sheet":"SE","index":3,"n_rows":51,"n_cols":34,"rows_kept":51,"cut":false,"hidden":false,"merged":[[6,3,6,4],[17,2,17,10],[7,2,7,3],[8,2,8,3],[8,8,8,9],[9,2,9,3],[10,2,10,3],[11,2,11,3],[12,2,12,3],[13,2,13,3],[13,8,13,9],[16,2,16,3],[10,8,10,9],[11,8,11,9],[12,8,12,9],[14,8,14,9],[15,8,15,9],[16,8,16,9],[34,2,34,3],[39,2,39,3],[38,2,38,4],[36,2,36,4],[35,2,35,4],[32,2,32,9],[21,2,21,4],[21,5,21,9],[31,7,31,8]]}
[]
[]
[null,null,"SELF EMPLOYED"]
[]
[]
[null,null,null,null,null,"Latest Year",null,"Prior Year"]
[null,null,null,"Period Ending"]
[null,null,"Profit and Loss"]
[null,null,"Net Profit before Tax/Distributions ",null,null,0,null,0]
[null,null,"Addbacks"]
[null,null,"Interest Expense",null,null,0,null,0]
[null,null,"Financed Leasing Expense",null,null,0,null,0,null,null,null,null,null,null,null,null,null,null,null,null,null,null,null,null,null,null,null,null,null,null,null,0]
[null,null,"Depreciation/ Amortisation of Intangibles",null,null,0,null,0]
[null,null,"Salaries/ Wages paid to owners",null,null,0,null,0,{"$f":"IF(OR(H14=\"\",H14=0),\"\",(F14-H14)/H14)","v":""},null,null,null,null,null,null,null,null,null,null,null,null,null,null,0]
[null,null,"Other Addbacks",null,null,0,null,0,""]
[null,null,"Other Addbacks",null,null,0,null,0,""]
[null,null,"Business - Cash from Operations",null,null,{"$f":"F9+SUM(F11:F16)","v":0},0,{"$f":"H9+SUM(H11:H16)","v":0},{"$f":"IF(OR(H17=\"\",H17=0),\"\",(F17-H17)/H17)","v":""}]
[]
[]
[]
{"$rows_left_out":32}
{"sheet":"Rental","index":4,"n_rows":21,"n_cols":32,"rows_kept":21,"cut":false,"hidden":false,"merged":[[19,4,19,5],[19,10,19,14],[20,4,20,5],[3,3,3,9],[3,10,4,13],[3,20,3,22],[3,23,3,25],[3,26,3,28],[3,29,3,31],[18,4,18,5]]}
[]
[]
[]
[null,null,null,"RENTAL INCOME & NEGATIVE GEARING CALCULATOR ",null,null,null,null,null,null,"Ownership Percentage",null,null,null,null,null,null,null,null,null,"APP 1",null,null,"APP 2",null,null,"APP 3",null,null,"APP 4"]
[]
[null,null,null,null,"Investment Property address","Type","Rental Income"," Frequency","Loan Amount"," Interest Rate","APP 1","APP 2","APP 3","APP 4","Total OP%",null,null,null,null,"DR","ARI","Interest","RI","ARI","Interest","RI","ARI","Interest","RI","ARI","Interest","RI"]
[null,null,null,"Property 1",null,null,null,"Please Select",null,null,null,null,null,null,{"$f":"IF(SUM(K7:N7)=0,\"\",SUM(K7:N7))","v":""},null,null,null,null,{"$f":"IF(F7=\"Residential long-term\",0.8,IF(F7=\"Residential short-term\",0.7,IF(F7=\"Commercial\",0.7,0)))","v":0},{"$f":"IF(O7<>100%,0,IF(H7=\"Please Select\", 0,IF(H7=\"Weekly\",G7*52*K7*T7,IF(H7=\"Fortnightly\",G7*26*K7*T7,IF(H7=\"Monthly\",G7*12*K7*T7,G7*K7*T7)))))","v":0},{"$f":"IF(O7<>100%,0,I7*J7*K7)","v":0},{"$f":"IF(O7<>100%,0,IF(H7=\"Please Select\", 0,IF(H7=\"Weekly\",G7*52*K7,IF(H7=\"Fortnightly\",G7*26*K7,IF(H7=\"Monthly\",G7*12*K7,G7*K7)))))","v":0},{"$f":"IF(O7<>100%,0,IF(H7=\"Please Select\", 0,IF(H7=\"Weekly\",G7*52*L7*T7,IF(H7=\"Fortnightly\",G7*26*L7*T7,IF(H7=\"Monthly\",G7*12*L7*T7,G7*L7*T7)))))","v":0},{"$f":"IF(O7<>100%,0,I7*J7*L7)","v":0},{"$f":"IF(O7<>100%,0,IF(H7=\"Please Select\", 0,IF(H7=\"Weekly\",G7*52*L7,IF(H7=\"Fortnightly\",G7*26*L7,IF(H7=\"Monthly\",G7*12*L7,G7*L7)))))","v":0},{"$f":"IF(O7<>100%,0,IF(H7=\"Please Select\", 0,IF(H7=\"Weekly\",G7*52*M7*T7,IF(H7=\"Fortnightly\",G7*26*M7*T7,IF(H7=\"Monthly\",G7*12*M7*T7,G7*M7*T7)))))","v":0},{"$f":"IF(O7<>100%,0,I7*J7*M7)","v":0},{"$f":"IF(O7<>100%,0,IF(H7=\"Please Select\", 0,IF(H7=\"Weekly\",G7*52*M7,IF(H7=\"Fortnightly\",G7*26*M7,IF(H7=\"Monthly\",G7*12*M7,G7*M7)))))","v":0},{"$f":"IF(O7<>100%,0,IF(H7=\"Please Select\", 0,IF(H7=\"Weekly\",G7*52*N7*T7,IF(H7=\"Fortnightly\",G7*26*N7*T7,IF(H7=\"Monthly\",G7*12*N7*T7,G7*N7*T7)))))","v":0},{"$f":"IF(O7<>100%,0,I7*J7*N7)","v":0},{"$f":"IF(O7<>100%,0,IF(H7=\"Please Select\", 0,IF(H7=\"Weekly\",G7*52*N7,IF(H7=\"Fortnightly\",G7*26*N7,IF(H7=\"Monthly\",G7*12*N7,G7*N7)))))","v":0}]
[null,null,null,"Property 2",null,null,null,"Please Select",null,null,null,null,null,null,{"$f":"IF(SUM(K8:N8)=0,\"\",SUM(K8:N8))","v":""},null,null,null,null,{"$f":"IF(F8=\"Residential long-term\",0.8,IF(F8=\"Residential short-term\",0.7,IF(F8=\"Commercial\",0.7,0)))","v":0},{"$f":"IF(O8<>100%,0,IF(H8=\"Please Select\", 0,IF(H8=\"Weekly\",G8*52*K8*T8,IF(H8=\"Fortnightly\",G8*26*K8*T8,IF(H8=\"Monthly\",G8*12*K8*T8,G8*K8*T8)))))","v":0},{"$f":"IF(O8<>100%,0,I8*J8*K8)","v":0},{"$f":"IF(O8<>100%,0,IF(H8=\"Please Select\", 0,IF(H8=\"Weekly\",G8*52*K8,IF(H8=\"Fortnightly\",G8*26*K8,IF(H8=\"Monthly\",G8*12*K8,G8*K8)))))","v":0},{"$f":"IF(O8<>100%,0,IF(H8=\"Please Select\", 0,IF(H8=\"Weekly\",G8*52*L8*T8,IF(H8=\"Fortnightly\",G8*26*L8*T8,IF(H8=\"Monthly\",G8*12*L8*T8,G8*L8*T8)))))","v":0},0,0,{"$f":"IF(O8<>100%,0,IF(H8=\"Please Select\", 0,IF(H8=\"Weekly\",G8*52*M8*T8,IF(H8=\"Fortnightly\",G8*26*M8*T8,IF(H8=\"Monthly\",G8*12*M8*T8,G8*M8*T8)))))","v":0},0,0,{"$f":"IF(O8<>100%,0,IF(H8=\"Please Select\", 0,IF(H8=\"Weekly\",G8*52*N8*T8,IF(H8=\"Fortnightly\",G8*26*N8*T8,IF(H8=\"Monthly\",G8*12*N8*T8,G8*N8*T8)))))","v":0},0,0]
[null,null,null,"Property 3",null,null,null,"Please Select",null,null,null,null,null,null,"",null,null,null,null,0,0,0,0,0,0,0,0,0,0,0,0,0]
[null,null,null,"Property 4",null,null,null,"Please Select",null,null,null,null,null,null,"",null,null,null,null,0,0,0,0,0,0,0,0,0,0,0,0,0]
[null,null,null,"Property 5",null,null,null,"Please Select",null,null,null,null,null,null,"",null,null,null,null,0,0,0,0,0,0,0,0,0,0,0,0,0]
[null,null,null,"Property 6",null,null,null,"Please Select",null,null,null,null,null,null,"",null,null,null,null,0,0,0,0,0,0,0,0,0,0,0,0,0]
[null,null,null,"Property 7",null,null,null,"Please Select",null,null,null,null,null,null,"",null,null,null,null,0,0,0,0,0,0,0,0,0,0,0,0,0]
[null,null,null,"Property 8",null,null,null,"Please Select",null,null,null,null,null,null,"",null,null,null,null,0,0,0,0,0,0,0,0,0,0,0,0,0]
[null,null,null,"Property 9",null,null,null,"Please Select",null,null,null,null,null,null,"",null,null,null,null,0,0,0,0,0,0,0,0,0,0,0,0,0]
[null,null,null,"Property 10",null,null,null,"Please Select",null,null,null,null,null,null,"",null,null,null,null,0,0,0,0,0,0,0,0,0,0,0,0,0]
[null,null,null,null,null,null,null,null,null,null,null,null,null,null,null,null,null,null,null,null,{"$f":"SUM(U7:U16)","v":0},{"$f":"SUM(V7:V16)","v":0},{"$f":"SUM(W7:W16)","v":0},0,0,0,0,0,0,0,0,0]
[null,null,null,null,null,null,"APPLICANT 1","APPLICANT 2","APPLICANT 3","APPLICANT 4"]
[null,null,null,null,"Rental Income",null,{"$f":"W17","v":0},{"$f":"Z17","v":0},{"$f":"AC17","v":0},{"$f":"AF17","v":0}]
[null,null,null,null,"Discounted Rental Income",null,{"$f":"U17","v":0},{"$f":"X17","v":0},{"$f":"AA17","v":0},{"$f":"AD17","v":0}]
{"$rows_left_out":2}
{"sheet":"Calc Data","index":5,"n_rows":50,"n_cols":12,"rows_kept":50,"cut":false,"hidden":true,"merged":[[36,15,36,18],[17,1,17,3],[25,15,25,18],[1,15,1,18],[1,9,1,12]]}
[]
[null,"Retail Margin",0.03,null,"Variable personal-loan rate",0.1159]
[null,"Retail Floor",0.08,null,"New car loan rate",7.0400000000000004E-2]
[null,"Commercial Margin",2.5000000000000001E-2]
[null,"Commercial Floor",0.08]
[]
[null,"Loan","Period",null,null,"Dependents Flags"]
[null,"Commercial Property","Please Select",null,null,"Applicant 1",{"$f":"IF(AND(Calc!AH29=\"App 1\",Calc!AE29>0),1,IF(AND(Calc!AH30=\"App 1\",Calc!AE30>0),1,IF(AND(Calc!AH31=\"App 1\",Calc!AE31>0),1,0)))","v":0}]
[null,"Commercial Plus","Weekly"]
[null,"Premium Package","Fortnightly"]
[null,"Low Rate Essentials","Monthly",null,null,"Applicant 2",{"$f":"IF(AND(Calc!AH28=\"App 2\",Calc!AE28>0),1,IF(AND(Calc!AH30=\"App 2\",Calc!AE30>0),1,IF(AND(Calc!AH31=\"App 2\",Calc!AE31>0),1,0)))","v":0}]
[null,"Standard Variable","Annually",null,null,"Applicant 3",{"$f":"IF(AND(Calc!AH28=\"App 3\",Calc!AE28>0),1,IF(AND(Calc!AH29=\"App 3\",Calc!AE29>0),1,IF(AND(Calc!AH31=\"App 3\",Calc!AE31>0),1,0)))","v":0}]
[null,"Equitismart",null,null,null,"Applicant 4",{"$f":"IF(AND(Calc!AH28=\"App 4\",Calc!AE28>0),1,IF(AND(Calc!AH29=\"App 4\",Calc!AE29>0),1,IF(AND(Calc!AH30=\"App 4\",Calc!AE30>0),1,0)))","v":0}]
[null,"Construction"]
[null,"Land"]
[]
[]
[null,"2022-2023"]
[null,"Tax Boundary","Tax Due","Excess %"]
[null,0,0,0]
{"$rows_left_out":31}
{"sheet":"HEM Table","index":6,"n_rows":91,"n_cols":22,"rows_kept":91,"cut":false,"hidden":true,"merged":[[19,0,21,2],[49,3,49,6],[56,3,56,5],[80,3,80,14]]}
[null,null,null,null,null,"\"HEM Table 1\" equivalent: by Income Level and Residency",null,null,null,null,null,null,"Version","2023 Q4"]
[null,null,null,null,null,null,null,"BASED ON PREDICTED VALUES FROM THE QUANTILE REGRESSIONS"]
[null,null,null,null,null,null,null,null,null,"Smoothed HEM"]
[]
[null,null,null,null,null,null,null,"Total current gross HH income from all sources (measured in current dollars)"]
[null,null,null,null,25000,25000,38000,50000,63000,76000,101000,126000,151000,176000,202000,252000,315000,378000]
[null,null,null,null,"or less","to","to","to","to","to","to","to","to","to","to","to","to","to"]
[null,null,null,null,null,38000,50000,63000,76000,101000,126000,151000,176000,202000,252000,315000,378000,630000]
[null,null,null,"Australia"]
[null,null,null,"Couple",0,577.37112077691938,592.80248923866702,612.87570230653466,650.86135184334967,710.17364568731784,790.57201488953683,863.72292660011283,952.40274124712857,991.24596645826273,1039.8894757354115,1169.5360345429374,1283.8028509591607,1350.4863582094147]
[null,null,null,"Couple with 1 child",0,0,684.36493423306592,704.49507774302117,742.58844228460543,802.06893590064442,882.69527023359262,956.05361424820603,1044.9849706066934,1083.9382681636118,1132.7197333019139,1262.733927778977,1377.3247678942896,1444.1973679832622]
[null,null,null,"Couple with 2 children",0,0,753.45434042300951,773.54893547448637,811.57512794538525,870.95065572696933,951.43481407598438,1024.6637477109252,1113.4381286486168,1152.3227278477937,1201.0181940692498,1330.8030324110825,1445.1916501699732,1511.9463556196945]
[null,null,null,"Couple with 3 children",0,0,0,843.73802146397747,881.72955151675797,941.05113182922094,1021.461988874392,1094.6242779389968,1183.3179262661724,1222.1672027254278,1270.8182714354075,1400.4850274199475,1514.7696450577321,1581.4635778282702]
[]
[null,null,null,"Single person",293.84495491326561,310.88818989722125,326.22551646503047,346.17642052081828,383.93057743905507,442.88147325127164,522.78991729981658,595.49507622743295,683.63454798778525,722.24100411316215,770.58813594605601,899.44473514849903,1013.0151808842029,1079.2924189644859]
[null,null,null,"Single parent with 1 child",0,422.20340605269445,437.69041745230828,457.83601723333499,495.95862019848295,555.48483943379745,636.17312668153579,709.58783044400752,798.58743646095206,837.5706610569556,886.38965991122666,1016.503741692415,1131.1825451341272,1198.1065966268554]
[null,null,null,"Single parent with 2 children",0,524.78955986487233,540.19825066159012,560.24193759165212,598.17165857552584,657.39671832785905,737.67675357677581,810.72003220067222,899.26938331703741,938.05539961550198,986.62740975381723,1116.0832086791279,1230.1818205750458,1296.767284920707]
[null,null,null,"Single parent with 3 children",0,0,642.70608387087191,662.64785794996919,700.38469695256867,759.30859722192065,839.18038047201583,911.85223395733692,999.95133017312276,1038.5401381740485,1086.8651595964079,1215.6626756658407,1329.1810960159644,1395.4279732145585]
[]
["Extrapolated HEM Table",null,null,"Income Band","A","B","C","D","E","F","G","H","I","J","K","L","M","N","O","O","O","O"]
{"$rows_left_out":72}
{"sheet":"Instructions","index":7,"n_rows":85,"n_cols":7,"rows_kept":85,"cut":false,"hidden":false,"merged":[[2,2,2,19],[41,2,41,19],[84,2,84,19],[118,4,118,13],[119,2,124,2]]}
[]
[]
[null,null,"Capacity Test Calculator User Guide"]
[]
[]
[]
[]
[]
[]
[]
[]
[]
[]
[]
[]
[]
[]
[]
[]
[]
{"$rows_left_out":66}
{"sheet":"Overview","index":8,"n_rows":30,"n_cols":7,"rows_kept":30,"cut":false,"hidden":true,"merged":[[1,1,1,4],[1,6,1,12],[3,1,3,4],[3,6,3,12],[5,1,5,4],[5,6,5,12],[7,1,7,4],[7,6,7,12],[9,1,9,4],[9,6,9,12],[11,1,11,4],[11,6,11,12],[13,1,13,4],[13,6,13,12],[15,1,15,4],[15,6,15,12],[17,1,17,4],[17,6,17,12],[19,1,19,4],[19,6,19,12],[21,1,21,4],[21,6,21,12],[23,1,23,4],[23,6,23,12],[25,1,25,4],[25,6,25,12],[27,1,27,4],[27,6,27,12],[29,1,29,4],[29,6,29,12]]}
[]
[null,"Spreadsheet Name",null,null,null,null,"Gateway Commercial Calculator"]
[]
[null,"Storage Location",null,null,null,null,"Authorised Risk - Capacity Calculators"]
[]
[null,"Spreadsheet Owner Name / Position",null,null,null,null,"Senior Manager, Credit and Operational Risk"]
[]
[null,"Senior Manager Name / Position",null,null,null,null,"Senior Manager, Credit and Operational Risk"]
[]
[null,"Department",null,null,null,null,"Credit and Operational Risk"]
[]
[null,"Purpose of the Spreadsheet",null,null,null,null,"Capacity calculation for commercial loans"]
[]
[null,"Major EUC",null,null,null,null,"Yes"]
[]
[null,"Level of Confidentiality",null,null,null,null,"Internal and broker use"]
[]
[null,"Security / Backup",null,null,null,null,"System backup"]
[]
[null,"Inputs ",null,null,null,null,"Credit policy, HEM, tax rates, interest rates, customer data"]
{"$rows_left_out":10}