{"text_format":"1","workbook":"xlsx","n_sheets":10,"sheets":["Calc","Location","Report","Rental","SE","Policy","Instructions","Calc Data","HEM Table","Overview"],"not_rendered":{"charts":0,"images":5,"macros":1,"external_links":0,"defined_names":6,"comments":0,"pivot_tables":0},"unopened":[],"bounds":{"document_bytes":16777216,"sheet_cells":100000,"rows_first":2000,"rows_last":500,"rows_between":2000,"halvings":0,"cell_chars":16384,"cell_head_chars":4096},"cells_cut":0,"cells_raw":0,"read":"whole","date_system":"1900"}

{"sheet":"Calc","index":0,"n_rows":52,"n_cols":40,"rows_kept":52,"cut":false,"hidden":false,"merged":[[29,23,29,30],[36,23,36,31],[39,29,39,30],[40,29,40,30],[39,31,39,34],[40,31,40,34],[41,29,43,34],[41,23,42,28],[43,23,43,28],[34,23,34,25],[34,26,34,28],[34,32,34,34],[36,32,36,34],[34,29,34,31],[29,31,29,34],[37,23,37,34],[49,12,49,13],[40,9,40,10],[40,12,40,13],[15,12,16,12],[36,15,36,16],[36,18,36,19],[22,18,22,19],[23,18,23,19],[15,13,16,14],[41,12,41,13],[41,15,41,16],[43,12,43,13],[39,12,39,13],[38,12,38,13],[48,15,48,16],[46,15,46,16],[47,15,47,16],[44,15,44,16],[45,12,45,13],[15,10,16,11],[34,15,34,16],[45,15,45,16],[37,18,37,19],[40,15,40,16],[49,6,49,7],[5,12,5,13],[35,12,35,13],[35,15,35,16],[49,18,49,19],[46,18,46,19],[49,15,49,16],[5,6,5,10],[5,15,5,19],[15,7,16,9],[49,9,49,10],[28,15,28,16],[29,15,29,16],[28,6,28,7],[28,9,28,10],[28,12,28,13],[39,6,39,7],[39,9,39,10],[38,6,38,7],[13,12,14,12],[44,12,44,13],[46,12,48,13],[29,18,29,19],[13,13,14,14],[24,18,24,19],[26,15,26,16],[11,28,11,30],[15,18,15,20],[20,15,20,16],[15,15,16,16],[27,23,27,30],[23,33,23,34],[22,33,22,34],[23,30,23,31],[21,33,21,34],[25,26,25,28],[28,23,28,25],[27,31,27,34],[28,26,28,28],[28,29,28,31],[28,32,28,34],[22,23,22,25],[23,23,23,25],[11,23,11,26],[22,30,22,31],[20,23,20,27],[20,28,20,34],[2,23,2,34],[44,18,44,19],[43,15,43,16],[11,15,12,16],[2,4,3,15],[15,23,15,26],[9,12,10,12],[9,13,10,14],[9,15,10,16],[11,13,12,14],[3,29,3,34],[3,25,3,26],[15,31,15,34],[15,28,15,30],[11,31,11,34],[13,18,13,20],[13,23,13,26],[13,31,13,34],[8,31,9,34],[8,18,9,21],[22,26,22,28],[25,23,25,25],[25,30,25,31],[8,28,9,30],[51,31,51,35],[40,18,40,19],[48,18,48,19],[43,18,43,19],[38,18,38,19],[35,18,35,19],[39,18,39,19],[47,18,47,19],[41,18,41,19],[45,18,45,19],[39,23,40,28],[45,23,48,34],[38,23,38,34],[8,23,9,26],[24,30,24,31],[24,23,24,25],[25,33,25,34],[21,29,21,32],[21,26,21,28],[23,26,23,28],[9,3,10,5],[9,6,10,6],[9,7,10,9],[21,2,21,4],[11,6,12,6],[11,7,12,9],[11,10,12,11],[15,3,16,5],[20,6,20,7],[20,9,20,10],[15,6,16,6],[13,6,14,6],[13,7,14,9],[13,10,14,11],[13,28,13,30],[24,33,24,34],[24,26,24,28],[26,9,26,10],[29,9,29,10],[9,10,10,11],[13,15,14,16],[20,2,20,4],[11,3,12,5],[13,3,14,5],[21,6,21,7],[21,9,21,10],[22,2,22,4],[27,9,27,10],[26,2,26,4],[25,3,25,4],[25,6,25,7],[25,9,25,10],[26,6,26,7],[23,2,23,4],[24,2,24,4],[28,3,28,4],[27,2,27,4],[27,6,27,7],[29,6,29,7],[29,2,29,4],[25,15,25,16],[39,15,39,16],[8,22,9,22],[37,15,37,16],[20,12,20,13],[21,15,21,16],[25,12,25,13],[29,12,29,13],[26,12,26,13],[38,15,38,16],[27,12,27,13],[34,12,34,13],[36,12,36,13],[37,12,37,13],[28,18,28,19],[34,18,34,19],[11,18,11,20],[21,12,21,13],[20,18,20,19],[21,18,21,19],[27,15,27,16],[11,12,12,12],[27,18,27,19],[25,18,25,19],[26,18,26,19],[34,9,34,10],[36,6,36,7],[36,9,36,10],[35,6,35,7],[35,9,35,10],[34,6,34,7],[36,2,36,4],[35,2,35,4],[37,2,37,4],[38,2,38,4],[47,6,47,7],[39,2,39,4],[40,2,40,4],[41,9,41,10],[44,9,44,10],[37,6,37,7],[46,6,46,7],[41,6,41,7],[37,9,37,10],[43,6,43,7],[43,9,43,10],[38,9,38,10],[44,6,44,7],[46,9,48,10],[48,2,48,4],[44,2,44,4],[42,15,42,16],[42,18,42,19],[42,2,42,4],[42,12,42,13],[48,6,48,7],[40,6,40,7],[43,2,43,4],[46,2,46,4],[47,2,47,4],[41,2,41,4]]}
[]
[]
[null,null,null,null,"GATEWAY CAPACITY TEST CALCULATOR V2024.1",null,null,null,null,null,null,null,null,null,null,null,null,null,null,null,null,null,null,"GATEWAY USE ONLY"]
[null,null,null,null,null,null,null,null,null,null,null,null,null,null,null,null,null,null,null,null,null,null,null,"DEAL No.",null,null,null,null,"NAME:"]
[null,null,null,null,"Released Date: 4 April 2024"]
[null,null,null,null,"Field Key",null,"Mandatory and must be completed",null,null,null,null,null,"Optional input fields",null,null,"Output fields and can't be completed"]
[null,null,null,null,null,null,null,null,null,null,null,null,null,null,null,null,null,null,null,null,null,null,null,"NO",null,null,null,null,null,null,null,"NO"]
[]
[null,null,"LOAN DETAILS",null,null,null,null,null,null,null,null,null,null,null,null,null,null,null,"Bridging",null,null,null,null,"No",null,null,null,null,"Guarantee",null,null,"No"]
[null,null,null,"Loan",null,null,"Loan Type","Loan Amount ($)",null,null,"Term (mths)",null,"Rate % p.a.","Int Only Term",null,"Indicative Payment (mthly)"]
[]
[null,null,1,null,null,null,null,null,null,null,null,null,null,0,null,{"$f":"IF(AND(D12<>\"\",G12<>\"\",H12<>\"\",K12<>\"\",M12<>\"\",N12<>\"\"),IF(N12>0,M12/12*H12,PMT(M12/12, K12,-H12)),\"\")","v":""},null,null,"Total New Loans",null,null,null,null,{"$f":"IF(SUM(H12:J17)=0,0,SUM(H12:J17))","v":0},null,null,null,null,"Security Value",null,null,0]
[]
[null,null,2,null,null,null,null,null,null,null,null,null,null,0,null,{"$f":"IF(AND(H14<>\"\",K14<>\"\",M14<>\"\"),IF(N14>0,M14/12*H14,PMT(M14/12, K14,-H14)),\"\")","v":""},null,null,"Existing GBL Loans",null,null,null,null,0,null,null,null,null,"LVR",null,null,{"$f":"IF(AF12=0,0,IF(OR(AF9=\"Family Pledge\",AF9=\"FHLDS\"),80%,X16/AF12))","v":0}]
[]
[null,null,3,null,null,null,null,null,null,null,null,null,null,0,null,{"$f":"IF(AND(H16<>\"\",K16<>\"\",M16<>\"\"),IF(N16>0,M16/12*H16,PMT(M16/12,K16,-H16)),\"\")","v":""},null,null,"Total Loans",null,null,null,null,{"$f":"SUM(X12,X14)","v":0},null,null,null,null,"LMI",null,null,{"$f":"IF(AF14>80%,\"YES\",\"NO\")","v":"NO"}]
[]
[]
[]
[]
{"$rows_left_out":33}
{"sheet":"Location","index":1,"n_rows":14,"n_cols":9,"rows_kept":14,"cut":false,"hidden":false,"merged":[[10,4,10,6],[11,4,11,6],[12,4,12,6]]}
[]
[null,null,"LOCATION CATEGORY TOOL "]
[]
[]
[null,null,null,null,"Step1: Select property type","Step 2: Enter postcode","Category",null,"Additional information"]
[null,null,"Security 1",null,null,null,{"$f":"IFERROR(IF(OR(E6=0,F6=0),\"\",INDEX(Report!$D$2:$D$5000,MATCH(1,(F6=Report!$A$2:$A$5000)*(E6=Report!$B$2:$B$5000),0))),\"ERROR\")","v":""},null,{"$f":"IF(G6=\"\",\"\",IF(G6=1,\"Standard policy applies\", IF(G6=2,\"Maximum LVR of 80%\",IF(G6=3,\"Maximum LVR of 70%\",\"Location outside of policy\"))))","v":""}]
[null,null,"Security 2",null,null,null,{"$f":"IFERROR(IF(OR(E7=0,F7=0),\"\",INDEX(Report!$D$2:$D$5000,MATCH(1,(F7=Report!$A$2:$A$5000)*(E7=Report!$B$2:$B$5000),0))),\"ERROR\")","v":""},null,{"$f":"IF(G7=\"\",\"\",IF(G7=1,\"Standard policy applies\", IF(G7=2,\"Maximum LVR of 80%\",IF(G7=3,\"Maximum LVR of 70%\",\"Location outside of policy\"))))","v":""}]
[null,null,"Security 3",null,null,null,{"$f":"IFERROR(IF(OR(E8=0,F8=0),\"\",INDEX(Report!$D$2:$D$5000,MATCH(1,(F8=Report!$A$2:$A$5000)*(E8=Report!$B$2:$B$5000),0))),\"ERROR\")","v":""},null,""]
[null,null,"Security 4",null,null,null,{"$f":"IFERROR(IF(OR(E9=0,F9=0),\"\",INDEX(Report!$D$2:$D$5000,MATCH(1,(F9=Report!$A$2:$A$5000)*(E9=Report!$B$2:$B$5000),0))),\"ERROR\")","v":""},null,""]
[]
[null,null,"Notes:",null,"* House: torrens title property"]
[]
[null,null,null,null,"* Unit: strata, company, community or another title that denotes a property within"]
[null,null,null,null,"a larger development"]

{"sheet":"Report","index":2,"n_rows":4863,"n_cols":8,"rows_kept":4863,"cut":false,"hidden":true,"merged":[]}
["structure_code","property_type","state_name","risk_category",null,null,"Version","2024-01-01"]
[800,"House","Northern Territory",3]
[800,"Unit","Northern Territory",3]
[810,"House","Northern Territory",2]
[810,"Unit","Northern Territory",3]
[812,"House","Northern Territory",2]
[812,"Unit","Northern Territory",3]
[820,"House","Northern Territory",2]
[820,"Unit","Northern Territory",3]
[822,"House","Northern Territory",2]
[822,"Unit","Northern Territory",3]
[828,"House","Northern Territory",2]
[828,"Unit","Northern Territory",3]
[829,"House","Northern Territory",4]
[829,"Unit","Northern Territory",4]
[830,"House","Northern Territory",2]
[830,"Unit","Northern Territory",3]
[832,"House","Northern Territory",2]
[832,"Unit","Northern Territory",3]
[834,"House","Northern Territory",2]
{"$rows_left_out":4844}
{"sheet":"Rental","index":3,"n_rows":21,"n_cols":32,"rows_kept":21,"cut":false,"hidden":false,"merged":[[20,4,20,5],[3,23,3,25],[3,26,3,28],[3,29,3,31],[3,20,3,22],[19,10,19,14],[3,3,3,9],[3,10,4,13],[18,4,18,5],[19,4,19,5]]}
[]
[]
[]
[null,null,null,"RENTAL INCOME & NEGATIVE GEARING CALCULATOR ",null,null,null,null,null,null,"Ownership Percentage",null,null,null,null,null,null,null,null,null,"APP 1",null,null,"APP 2",null,null,"APP 3",null,null,"APP 4"]
[]
[null,null,null,null,"Investment Property address","Type","Rental Income"," Frequency","Loan Amount"," Interest Rate","APP 1","APP 2","APP 3","APP 4","Total OP%",null,null,null,null,"DR","ARI","Interest","RI","ARI","Interest","RI","ARI","Interest","RI","ARI","Interest","RI"]
[null,null,null,"Property 1",null,null,null,"Please Select",null,null,null,null,null,null,{"$f":"IF(SUM(K7:N7)=0,\"\",SUM(K7:N7))","v":""},null,null,null,null,{"$f":"IF(F7=\"Residential long-term\",0.8,IF(F7=\"Residential short-term\",0.7,IF(F7=\"Commercial\",0.7,0)))","v":0},{"$f":"IF(O7<>100%,0,IF(H7=\"Please Select\", 0,IF(H7=\"Weekly\",G7*52*K7*T7,IF(H7=\"Fortnightly\",G7*26*K7*T7,IF(H7=\"Monthly\",G7*12*K7*T7,G7*K7*T7)))))","v":0},{"$f":"IF(O7<>100%,0,I7*J7*K7)","v":0},{"$f":"IF(O7<>100%,0,IF(H7=\"Please Select\", 0,IF(H7=\"Weekly\",G7*52*K7,IF(H7=\"Fortnightly\",G7*26*K7,IF(H7=\"Monthly\",G7*12*K7,G7*K7)))))","v":0},{"$f":"IF(O7<>100%,0,IF(H7=\"Please Select\", 0,IF(H7=\"Weekly\",G7*52*L7*T7,IF(H7=\"Fortnightly\",G7*26*L7*T7,IF(H7=\"Monthly\",G7*12*L7*T7,G7*L7*T7)))))","v":0},{"$f":"IF(O7<>100%,0,I7*J7*L7)","v":0},{"$f":"IF(O7<>100%,0,IF(H7=\"Please Select\", 0,IF(H7=\"Weekly\",G7*52*L7,IF(H7=\"Fortnightly\",G7*26*L7,IF(H7=\"Monthly\",G7*12*L7,G7*L7)))))","v":0},{"$f":"IF(O7<>100%,0,IF(H7=\"Please Select\", 0,IF(H7=\"Weekly\",G7*52*M7*T7,IF(H7=\"Fortnightly\",G7*26*M7*T7,IF(H7=\"Monthly\",G7*12*M7*T7,G7*M7*T7)))))","v":0},{"$f":"IF(O7<>100%,0,I7*J7*M7)","v":0},{"$f":"IF(O7<>100%,0,IF(H7=\"Please Select\", 0,IF(H7=\"Weekly\",G7*52*M7,IF(H7=\"Fortnightly\",G7*26*M7,IF(H7=\"Monthly\",G7*12*M7,G7*M7)))))","v":0},{"$f":"IF(O7<>100%,0,IF(H7=\"Please Select\", 0,IF(H7=\"Weekly\",G7*52*N7*T7,IF(H7=\"Fortnightly\",G7*26*N7*T7,IF(H7=\"Monthly\",G7*12*N7*T7,G7*N7*T7)))))","v":0},{"$f":"IF(O7<>100%,0,I7*J7*N7)","v":0},{"$f":"IF(O7<>100%,0,IF(H7=\"Please Select\", 0,IF(H7=\"Weekly\",G7*52*N7,IF(H7=\"Fortnightly\",G7*26*N7,IF(H7=\"Monthly\",G7*12*N7,G7*N7)))))","v":0}]
[null,null,null,"Property 2",null,null,null,"Please Select",null,null,null,null,null,null,{"$f":"IF(SUM(K8:N8)=0,\"\",SUM(K8:N8))","v":""},null,null,null,null,{"$f":"IF(F8=\"Residential long-term\",0.8,IF(F8=\"Residential short-term\",0.7,IF(F8=\"Commercial\",0.7,0)))","v":0},{"$f":"IF(O8<>100%,0,IF(H8=\"Please Select\", 0,IF(H8=\"Weekly\",G8*52*K8*T8,IF(H8=\"Fortnightly\",G8*26*K8*T8,IF(H8=\"Monthly\",G8*12*K8*T8,G8*K8*T8)))))","v":0},{"$f":"IF(O8<>100%,0,I8*J8*K8)","v":0},{"$f":"IF(O8<>100%,0,IF(H8=\"Please Select\", 0,IF(H8=\"Weekly\",G8*52*K8,IF(H8=\"Fortnightly\",G8*26*K8,IF(H8=\"Monthly\",G8*12*K8,G8*K8)))))","v":0},{"$f":"IF(O8<>100%,0,IF(H8=\"Please Select\", 0,IF(H8=\"Weekly\",G8*52*L8*T8,IF(H8=\"Fortnightly\",G8*26*L8*T8,IF(H8=\"Monthly\",G8*12*L8*T8,G8*L8*T8)))))","v":0},0,0,{"$f":"IF(O8<>100%,0,IF(H8=\"Please Select\", 0,IF(H8=\"Weekly\",G8*52*M8*T8,IF(H8=\"Fortnightly\",G8*26*M8*T8,IF(H8=\"Monthly\",G8*12*M8*T8,G8*M8*T8)))))","v":0},0,0,{"$f":"IF(O8<>100%,0,IF(H8=\"Please Select\", 0,IF(H8=\"Weekly\",G8*52*N8*T8,IF(H8=\"Fortnightly\",G8*26*N8*T8,IF(H8=\"Monthly\",G8*12*N8*T8,G8*N8*T8)))))","v":0},0,0]
[null,null,null,"Property 3",null,null,null,"Please Select",null,null,null,null,null,null,"",null,null,null,null,0,0,0,0,0,0,0,0,0,0,0,0,0]
[null,null,null,"Property 4",null,null,null,"Please Select",null,null,null,null,null,null,"",null,null,null,null,0,0,0,0,0,0,0,0,0,0,0,0,0]
[null,null,null,"Property 5",null,null,null,"Please Select",null,null,null,null,null,null,{"$f":"IF(SUM(K11:N11)=0,\"\",SUM(K11:N11))","v":""},null,null,null,null,0,0,0,0,0,0,0,0,0,0,0,0,0]
[null,null,null,"Property 6",null,null,null,"Please Select",null,null,null,null,null,null,"",null,null,null,null,0,0,0,0,0,0,0,0,0,0,0,0,0]
[null,null,null,"Property 7",null,null,null,"Please Select",null,null,null,null,null,null,"",null,null,null,null,0,0,0,0,0,0,0,0,0,0,0,0,0]
[null,null,null,"Property 8",null,null,null,"Please Select",null,null,null,null,null,null,"",null,null,null,null,0,0,0,0,0,0,0,0,0,0,0,0,0]
[null,null,null,"Property 9",null,null,null,"Please Select",null,null,null,null,null,null,"",null,null,null,null,0,0,0,0,0,0,0,0,0,0,0,0,0]
[null,null,null,"Property 10",null,null,null,"Please Select",null,null,null,null,null,null,"",null,null,null,null,0,0,0,0,0,0,0,0,0,0,0,0,0]
[null,null,null,null,null,null,null,null,null,null,null,null,null,null,null,null,null,null,null,null,{"$f":"SUM(U7:U16)","v":0},{"$f":"SUM(V7:V16)","v":0},{"$f":"SUM(W7:W16)","v":0},0,0,0,0,0,0,0,0,0]
[null,null,null,null,null,null,"APPLICANT 1","APPLICANT 2","APPLICANT 3","APPLICANT 4"]
[null,null,null,null,"Rental Income",null,{"$f":"W17","v":0},{"$f":"Z17","v":0},{"$f":"AC17","v":0},{"$f":"AF17","v":0}]
[null,null,null,null,"Discounted Rental Income",null,{"$f":"U17","v":0},{"$f":"X17","v":0},{"$f":"AA17","v":0},{"$f":"AD17","v":0}]
{"$rows_left_out":2}
{"sheet":"SE","index":4,"n_rows":40,"n_cols":14,"rows_kept":40,"cut":false,"hidden":false,"merged":[[21,2,21,4],[21,5,21,9],[31,7,31,8],[34,2,34,3],[39,2,39,3],[38,2,38,4],[36,2,36,4],[35,2,35,4],[32,2,32,9],[6,3,6,4],[17,2,17,10],[7,2,7,3],[8,2,8,3],[8,8,8,9],[9,2,9,3],[10,2,10,3],[11,2,11,3],[12,2,12,3],[13,2,13,3],[13,8,13,9],[16,2,16,3],[16,8,16,9]]}
[]
[]
[null,null,"SELF EMPLOYED"]
[]
[]
[null,null,null,null,null,"Latest Year",null,"Prior Year"]
[null,null,null,"Period Ending"]
[null,null,"Profit and Loss"]
[null,null,"Net Profit before Tax ",null,null,0,null,0,{"$f":"IF(OR(H9=\"\",H9=0),\"\",(F9-H9)/H9)","v":""}]
[null,null,"Addbacks"]
[null,null,"Interest Expense",null,null,0,null,0,""]
[null,null,"Financed Leasing Expense",null,null,0,null,0,""]
[null,null,"Depreciation/ Amortisation of Intangibles",null,null,0,null,0,""]
[null,null,"Salaries/ Wages paid to owners",null,null,0,null,0,{"$f":"IF(OR(H14=\"\",H14=0),\"\",(F14-H14)/H14)","v":""}]
[null,null,"Other Addbacks",null,null,0,null,0,""]
[null,null,"Other Addbacks",null,null,0,null,0,""]
[null,null,"Business - Cash from Operations",null,null,{"$f":"F9+SUM(F11:F16)","v":0},0,{"$f":"H9+SUM(H11:H16)","v":0},{"$f":"IF(OR(H17=\"\",H17=0),\"\",(F17-H17)/H17)","v":""}]
[]
[]
[]
{"$rows_left_out":21}
{"sheet":"Policy","index":5,"n_rows":48,"n_cols":5,"rows_kept":48,"cut":false,"hidden":false,"merged":[[47,2,47,4],[31,1,31,2],[24,1,24,2],[2,1,2,4],[5,1,5,4],[40,1,40,4],[20,3,20,4],[34,1,34,4],[37,1,37,4],[13,1,16,1],[26,1,26,2],[27,1,27,2],[28,1,28,2],[29,1,29,2],[30,1,30,2],[23,1,23,2],[25,1,25,2],[43,2,43,4],[44,2,44,4],[45,2,45,4],[46,2,46,4],[22,1,22,2],[15,2,15,4],[16,2,16,4],[20,1,21,2],[10,2,10,4],[11,2,11,4],[13,2,13,4],[14,2,14,4],[9,1,11,1],[9,2,9,4]]}
[]
[null,"Policy Guidelines"]
[null,"The following policy guidelines represent only a small overview of the total policy. Please make sure you refer to Gateway's Broker Operations Manual for more information."]
[]
[null,"Qualifying rate"]
[null,"The qualifying rate of new loans is the higher of product rate plus margin or floor rate. Different floor rates and margins may be applicable to consumer and commercial facilities.  Qualifying rate of existing facilities depends on the product type."]
[]
[]
[null,"Maximum and Minimum loan terms and amounts"]
[null,"TERM","Maximum loan term is 30 years"]
[null,null,"Maximum interest only term is 5 years"]
[null,null,"Maximum fixed interest rate term is 5 years"]
[]
[null,"MINIMUM LOAN AMOUNT","$20,000 Standard Variable Rate home loans"]
[null,null,"$50,000 Fixed Rate home loans"]
[null,null,"$150,000 Package product home loans"]
[null,null,"$50,000 Construction and Vacant Land loans"]
[]
[]
[null,"Loan to Valuation Ratio (LVR)"]
{"$rows_left_out":29}
{"sheet":"Instructions","index":6,"n_rows":97,"n_cols":8,"rows_kept":97,"cut":false,"hidden":false,"merged":[[2,2,2,19],[33,2,33,19],[96,2,96,19],[103,4,103,13],[104,2,109,2]]}
[]
[]
[null,null,"Capacity Test Calculator User Guide"]
[]
[]
[]
[]
[]
[]
[]
[]
[]
[]
[]
[]
[]
[]
[]
[]
[]
{"$rows_left_out":78}
{"sheet":"Calc Data","index":7,"n_rows":49,"n_cols":12,"rows_kept":49,"cut":false,"hidden":true,"merged":[[15,1,15,3],[23,15,23,18],[1,15,1,18],[1,9,1,12]]}
[]
[null,"Margin Rate Commercial",2.5000000000000001E-2,null,"Variable personal-loan rate",0.1159]
[null,"Floor Rate Commercial",0.08,null,"New car loan rate",7.0400000000000004E-2]
[null,"Margin Rate Residential",0.03]
[null,"Floor Rate Residential",0.08]
[]
[null,"Loan","Period",null,null,"Dependents Flags"]
[null,"Green Plus Home Loan","Please Select",null,null,"Applicant 1",{"$f":"IF(AND(Calc!AH24=\"App 1\",Calc!AE24>0),1,IF(AND(Calc!AH25=\"App 1\",Calc!AE25>0),1,IF(AND(Calc!AH26=\"App 1\",Calc!AE26>0),1,0)))","v":0}]
[null,"Green Home Loan","Weekly",null,null,"Applicant 2",{"$f":"IF(AND(Calc!AH23=\"App 2\",Calc!AE23>0),1,IF(AND(Calc!AH25=\"App 2\",Calc!AE25>0),1,IF(AND(Calc!AH26=\"App 2\",Calc!AE26>0),1,0)))","v":0}]
[null,"Premium Package","Fortnightly",null,null,"Applicant 3",{"$f":"IF(AND(Calc!AH23=\"App 3\",Calc!AE23>0),1,IF(AND(Calc!AH24=\"App 3\",Calc!AE24>0),1,IF(AND(Calc!AH26=\"App 3\",Calc!AE26>0),1,0)))","v":0}]
[null,"Low Rate Essentials","Monthly",null,null,"Applicant 4",{"$f":"IF(AND(Calc!AH23=\"App 4\",Calc!AE23>0),1,IF(AND(Calc!AH24=\"App 4\",Calc!AE24>0),1,IF(AND(Calc!AH25=\"App 4\",Calc!AE25>0),1,0)))","v":0}]
[null,"Standard Variable","Annually"]
[null,"Equitismart"]
[null,"Construction"]
[null,"Land"]
[null,"2022-2023 Tax Rates"]
[null,"Tax Boundary","Tax Due","Excess %"]
[null,0,0,0]
[null,18200,0,0.19]
[null,45000,{"$f":"C19+(B20-B19)*D19","v":5092},0.32500000000000001]
{"$rows_left_out":30}
{"sheet":"HEM Table","index":8,"n_rows":92,"n_cols":22,"rows_kept":92,"cut":false,"hidden":true,"merged":[[89,12,89,13],[91,12,91,13],[90,12,90,13],[49,3,49,6],[19,0,21,2],[56,3,56,5],[80,3,80,14],[88,12,88,13]]}
[null,null,null,null,null,"\"HEM Table 1\" equivalent: by Income Level and Residency",null,null,null,null,null,null,"Version","2023 Q4"]
[null,null,null,null,null,null,null,"BASED ON PREDICTED VALUES FROM THE QUANTILE REGRESSIONS"]
[null,null,null,null,null,null,null,null,null,"Smoothed HEM"]
[]
[null,null,null,null,null,null,null,"Total current gross HH income from all sources (measured in current dollars)"]
[null,null,null,null,25000,25000,38000,50000,63000,76000,101000,126000,151000,176000,202000,252000,315000,378000]
[null,null,null,null,"or less","to","to","to","to","to","to","to","to","to","to","to","to","to"]
[null,null,null,null,null,38000,50000,63000,76000,101000,126000,151000,176000,202000,252000,315000,378000,630000]
[null,null,null,"Australia"]
[null,null,null,"Couple",0,577.37112077691938,592.80248923866702,612.87570230653466,650.86135184334967,710.17364568731784,790.57201488953683,863.72292660011283,952.40274124712857,991.24596645826273,1039.8894757354115,1169.5360345429374,1283.8028509591607,1350.4863582094147]
[null,null,null,"Couple with 1 child",0,0,684.36493423306592,704.49507774302117,742.58844228460543,802.06893590064442,882.69527023359262,956.05361424820603,1044.9849706066934,1083.9382681636118,1132.7197333019139,1262.733927778977,1377.3247678942896,1444.1973679832622]
[null,null,null,"Couple with 2 children",0,0,753.45434042300951,773.54893547448637,811.57512794538525,870.95065572696933,951.43481407598438,1024.6637477109252,1113.4381286486168,1152.3227278477937,1201.0181940692498,1330.8030324110825,1445.1916501699732,1511.9463556196945]
[null,null,null,"Couple with 3 children",0,0,0,843.73802146397747,881.72955151675797,941.05113182922094,1021.461988874392,1094.6242779389968,1183.3179262661724,1222.1672027254278,1270.8182714354075,1400.4850274199475,1514.7696450577321,1581.4635778282702]
[]
[null,null,null,"Single person",293.84495491326561,310.88818989722125,326.22551646503047,346.17642052081828,383.93057743905507,442.88147325127164,522.78991729981658,595.49507622743295,683.63454798778525,722.24100411316215,770.58813594605601,899.44473514849903,1013.0151808842029,1079.2924189644859]
[null,null,null,"Single parent with 1 child",0,422.20340605269445,437.69041745230828,457.83601723333499,495.95862019848295,555.48483943379745,636.17312668153579,709.58783044400752,798.58743646095206,837.5706610569556,886.38965991122666,1016.503741692415,1131.1825451341272,1198.1065966268554]
[null,null,null,"Single parent with 2 children",0,524.78955986487233,540.19825066159012,560.24193759165212,598.17165857552584,657.39671832785905,737.67675357677581,810.72003220067222,899.26938331703741,938.05539961550198,986.62740975381723,1116.0832086791279,1230.1818205750458,1296.767284920707]
[null,null,null,"Single parent with 3 children",0,0,642.70608387087191,662.64785794996919,700.38469695256867,759.30859722192065,839.18038047201583,911.85223395733692,999.95133017312276,1038.5401381740485,1086.8651595964079,1215.6626756658407,1329.1810960159644,1395.4279732145585]
[]
["Extrapolated HEM Table",null,null,"Income Band","A","B","C","D","E","F","G","H","I","J","K","L","M","N","O","O","O","O"]
{"$rows_left_out":73}
{"sheet":"Overview","index":9,"n_rows":28,"n_cols":7,"rows_kept":28,"cut":false,"hidden":true,"merged":[[23,1,23,4],[23,6,23,12],[25,1,25,4],[25,6,25,12],[27,1,27,4],[27,6,27,12],[17,1,17,4],[17,6,17,12],[19,1,19,4],[19,6,19,12],[21,1,21,4],[21,6,21,12],[11,1,11,4],[11,6,11,12],[13,1,13,4],[13,6,13,12],[15,1,15,4],[15,6,15,12],[7,1,7,4],[7,6,7,12],[9,1,9,4],[9,6,9,12],[1,1,1,4],[1,6,1,12],[3,1,3,4],[3,6,3,12],[5,1,5,4],[5,6,5,12]]}
[]
[null,"Spreadsheet Name",null,null,null,null,"Gateway Capacity Calculator"]
[]
[null,"Storage Location"]
[]
[null,"Spreadsheet Owner Name / Position",null,null,null,null,"Senior Manager Credit & Operational Risk"]
[]
[null,"Department",null,null,null,null,"Credit and Operational Risk"]
[]
[null,"Purpose of the Spreadsheet",null,null,null,null,"Capacity calculation for home loans"]
[]
[null,"Major EUC",null,null,null,null,"Yes"]
[]
[null,"Level of Confidentiality",null,null,null,null,"Internal and broker use"]
[]
[null,"Security / Backup",null,null,null,null,"System backup"]
[]
[null,"Inputs ",null,null,null,null,"Credit policy, HEM, tax rates, interest rates, customer data"]
[]
[null,"Outputs",null,null,null,null,"NIS output"]
{"$rows_left_out":8}